{"text_format":"1","workbook":"xlsx","n_sheets":19,"sheets":["reportCreation","cmpLogo","HOME_FORM","Company Info","General Assumptions","Income Assumptions","Cover Page","tblReference","Executive Summary","Property Description","Property Photos","Cash Flow Analysis","Expense Assumptions","Mortgage Summary","Amortization Schedule","Graphs CashFlowProj_CashRet","Graphs CapRate_DebtRat","About Us","Terms & Definitions"],"not_rendered":{"charts":5,"images":3,"macros":1,"external_links":8,"defined_names":134,"comments":0,"pivot_tables":0},"unopened":[],"bounds":{"document_bytes":16777216,"sheet_cells":100000,"rows_first":2000,"rows_last":500,"rows_between":2000,"halvings":0,"cell_chars":16384,"cell_head_chars":4096},"cells_cut":0,"cells_raw":0,"read":"whole","date_system":"1900"}

{"sheet":"reportCreation","index":0,"n_rows":2,"n_cols":2,"rows_kept":2,"cut":false,"hidden":true,"merged":[[1,1,4,7]]}
[]
[null,"Printing: Please check which pages you'd like generated in the report"]

{"sheet":"cmpLogo","index":1,"n_rows":0,"n_cols":0,"rows_kept":0,"cut":false,"hidden":true,"merged":[]}

{"sheet":"HOME_FORM","index":2,"n_rows":9,"n_cols":9,"rows_kept":9,"cut":false,"hidden":false,"merged":[[8,1,8,4],[8,8,8,11],[4,1,6,12]]}
[]
[]
[]
[]
[null,"Real Estate Investment Analysis Software"]
[]
[]
[]
[null,"Inputs",null,null,null,null,null,null,"Marketing Reports"]

{"sheet":"Company Info","index":3,"n_rows":11,"n_cols":2,"rows_kept":11,"cut":false,"hidden":true,"merged":[]}
["Your COMPANY Information"]
["Your Name","[Enter Name]"]
["Your Company Name","[Enter Company Name]"]
["Company Address","[Enter Company Address]"]
["City, State, Zip","[Enter City, State, Zip]"]
["Phone with Area Code","[Enter Phone]"]
[]
["PROPERTY Information"]
["Property Name","[Enter Property Name]"]
["Property Street Address","[Enter Property Street Address]"]
["City, State, Zip","[Enter City, State, Zip]"]

{"sheet":"General Assumptions","index":4,"n_rows":42,"n_cols":3,"rows_kept":42,"cut":false,"hidden":true,"merged":[[3,1,5,6]]}
[]
[]
[]
[null,"Real Estate Investment Analysis Software"]
[]
[]
[]
[]
[null,"GENERAL ASSUMPTIONS"]
[]
[null,"Property"]
[null,"Purhase Price",1000000]
[null,"*Closing Costs",10000]
[null,"Cash Reserves ",2000]
[null,"Initial Improvements ",5000]
[null,"Total Cost",{"$f":"C12+C13+C15","v":1015000}]
[null,"*Include commissions, legal, appraisal, home inspection, applicances"]
[]
[null,"Mortgage Details"]
[null,"Down Payment %",0.3]
{"$rows_left_out":23}
{"sheet":"Income Assumptions","index":5,"n_rows":50,"n_cols":5,"rows_kept":50,"cut":false,"hidden":true,"merged":[[3,1,5,7]]}
[]
[]
[]
[null,"Real Estate Investment Analysis Software"]
[]
[]
[]
[null,null,"INCOME ASSUMPTIONS"]
[]
[null,null,"Type of Property: ","Single Family"]
[]
[null,null,"RENT ROLL "]
[]
[null,null,"Unit Type","Number of Units","Lease Amount "]
[]
[null,1,{"$f":"IF(D10=\"Type Of Property\",\"\",IF(ISNA(VLOOKUP(CONCATENATE(B16,D10),tblReference!C:D,2,FALSE)),\"\",VLOOKUP(CONCATENATE(B16,D10),tblReference!C:D,2,FALSE)))","v":"Single Family"},{"$f":"IF(C16=\"\",\"\",VLOOKUP(C16,tblReference!D:F,2,FALSE))","v":1},6000]
[null,{"$f":"B16+1","v":2},{"$f":"IF(D10=\"Type Of Property\",\"\",IF(ISNA(VLOOKUP(CONCATENATE(B17,D10),tblReference!C:D,2,FALSE)),\"\",VLOOKUP(CONCATENATE(B17,D10),tblReference!C:D,2,FALSE)))","v":""},{"$f":"IF(C17=\"\",\"\",VLOOKUP(C17,tblReference!D:F,2,FALSE))","v":""}]
[null,{"$f":"B17+1","v":3},{"$f":"IF(D10=\"Type Of Property\",\"\",IF(ISNA(VLOOKUP(CONCATENATE(B18,D10),tblReference!C:D,2,FALSE)),\"\",VLOOKUP(CONCATENATE(B18,D10),tblReference!C:D,2,FALSE)))","v":""},{"$f":"IF(C18=\"\",\"\",VLOOKUP(C18,tblReference!D:F,2,FALSE))","v":""}]
[null,4]
[null,5]
{"$rows_left_out":31}
{"sheet":"Cover Page","index":6,"n_rows":58,"n_cols":2,"rows_kept":58,"cut":false,"hidden":true,"merged":[[15,0,15,10],[18,0,18,10],[4,0,6,10]]}
[]
[]
[]
[]
["Real Estate Investment Analysis Software"]
[]
[]
[]
[]
[]
[]
[]
[]
[]
[]
["RENTAL PROPERTY INVESTMENT PROPOSAL"]
[]
[]
[]
[]
{"$rows_left_out":39}
{"sheet":"tblReference","index":7,"n_rows":5,"n_cols":6,"rows_kept":5,"cut":false,"hidden":true,"merged":[]}
["Record Num (col B on inc. Assumption)","Type Of Property","Concatenate","Unit Type","Number Of Units","Lease Amount"]
[1,"Single Family",{"$f":"CONCATENATE(A2,B2)","v":"1Single Family"},"Single Family",1,6500]
[1,"Multi-Tenant",{"$f":"CONCATENATE(A3,B3)","v":"1Multi-Tenant"},"1 Bedroom",5,450]
[2,"Multi-Tenant",{"$f":"CONCATENATE(A4,B4)","v":"2Multi-Tenant"},"2 Bedroom",8,650]
[3,"Multi-Tenant",{"$f":"CONCATENATE(A5,B5)","v":"3Multi-Tenant"},"3 Bedroom",4,1250]

{"sheet":"Executive Summary","index":8,"n_rows":52,"n_cols":9,"rows_kept":52,"cut":false,"hidden":true,"merged":[[21,6,21,9],[42,4,42,5],[43,4,43,5],[44,4,44,5],[45,4,45,5],[42,6,42,7],[43,6,43,7],[44,6,44,7],[45,6,45,7],[42,8,42,9],[43,8,43,9],[44,8,44,9],[45,8,45,9],[31,8,31,9],[38,8,38,9],[39,8,39,9],[37,6,37,7],[38,6,38,7],[39,6,39,7],[36,4,36,5],[37,4,37,5],[49,8,49,9],[50,8,50,9],[51,8,51,9],[23,4,23,5],[24,4,24,5],[25,4,25,5],[26,4,26,5],[27,4,27,5],[31,4,31,5],[31,6,31,7],[33,6,33,7],[34,6,34,7],[35,6,35,7],[33,4,33,5],[34,4,34,5],[35,4,35,5],[7,6,7,9],[4,1,6,9],[29,4,29,5],[47,6,47,9],[48,8,48,9],[41,4,41,5],[41,6,41,7],[41,8,41,9],[33,8,33,9],[34,8,34,9],[35,8,35,9],[36,8,36,9],[37,8,37,9],[38,4,38,5],[39,4,39,5],[36,6,36,7]]}
[]
[]
[]
[]
[null,"Real Estate Investment Analysis Software"]
[]
[]
[null,"Executive Summary"]
[]
[]
[]
[]
[]
[]
[]
[]
[]
[null,null,null,null,null,null,{"$f":"'Company Info'!B9","v":"[Enter Property Name]"}]
[null,null,null,null,null,null,{"$f":"'Company Info'!B10","v":"[Enter Property Street Address]"}]
[null,null,null,null,null,null,{"$f":"'Company Info'!B11","v":"[Enter City, State, Zip]"}]
{"$rows_left_out":33}
{"sheet":"Property Description","index":9,"n_rows":23,"n_cols":7,"rows_kept":23,"cut":false,"hidden":true,"merged":[[4,1,6,9],[7,1,7,9],[22,1,49,9]]}
[]
[]
[]
[]
[null,"Real Estate Investment Analysis Software"]
[]
[]
[null,"Property Overview"]
[]
[]
[]
[]
[]
[]
[]
[]
[]
[null,null,null,null,null,null,{"$f":"'Company Info'!B9","v":"[Enter Property Name]"}]
[null,null,null,null,null,null,{"$f":"'Company Info'!B10","v":"[Enter Property Street Address]"}]
[null,null,null,null,null,null,{"$f":"'Company Info'!B11","v":"[Enter City, State, Zip]"}]
{"$rows_left_out":4}
{"sheet":"Property Photos","index":10,"n_rows":68,"n_cols":11,"rows_kept":68,"cut":false,"hidden":true,"merged":[[4,1,6,14],[52,1,53,5],[52,10,53,14],[67,1,68,5],[67,10,68,14],[7,1,8,14],[22,1,23,5],[22,10,23,14],[37,1,38,5],[37,10,38,14],[9,1,10,14]]}
[]
[]
[]
[]
[null,"Real Estate Investment Analysis Software"]
[]
[]
[null,{"$f":"'Company Info'!B9","v":"[Enter Property Name]"}]
[]
[null,{"$f":"CONCATENATE('Company Info'!B10,CHAR(10),'Company Info'!B11)","v":"[Enter Property Street Address]\n[Enter City, State, Zip]"}]
[]
[]
[]
[]
[]
[]
[]
[]
[]
[]
{"$rows_left_out":49}
{"sheet":"Cash Flow Analysis","index":11,"n_rows":48,"n_cols":22,"rows_kept":48,"cut":false,"hidden":true,"merged":[[4,1,6,12]]}
[]
[]
[]
[]
[null,"Real Estate Investment Analysis Software"]
[]
[]
[]
[null,"CASH FLOW ANALYSIS",null,null,null,null,null,null,null,null,null,null,null,null,null,null,null,null,null,null,"Pie Chart"]
[null,null,null,null,null,null,null,null,null,null,null,null,null,null,null,null,null,null,null,null,"Annual Income",{"$f":"D18","v":7521.7699925480265}]
[null,"Operating Cash Flow",null,1,{"$f":"D11+1","v":2},{"$f":"E11+1","v":3},4,5,6,7,{"$f":"J11+1","v":8},9,10,null,null,null,null,null,null,null,"Vacancy/Bad Debts",{"$f":"-D13","v":3600}]
[null,"Total Annual Income",null,{"$f":"'Income Assumptions'!$E$49*12","v":72000},{"$f":"((D12*'General Assumptions'!$C$41)+D12)*IF(E11<='General Assumptions'!$C$32,1,0)","v":73800},{"$f":"((E12*'General Assumptions'!$C$41)+E12)*IF(F11<='General Assumptions'!$C$32,1,0)","v":75645},{"$f":"((F12*'General Assumptions'!$C$41)+F12)*IF(G11<='General Assumptions'!$C$32,1,0)","v":77536.125},{"$f":"((G12*'General Assumptions'!$C$41)+G12)*IF(H11<='General Assumptions'!$C$32,1,0)","v":79474.528124999997},{"$f":"((H12*'General Assumptions'!$C$41)+H12)*IF(I11<='General Assumptions'!$C$32,1,0)","v":81461.391328124999},{"$f":"((I12*'General Assumptions'!$C$41)+I12)*IF(J11<='General Assumptions'!$C$32,1,0)","v":83497.926111328125},{"$f":"((J12*'General Assumptions'!$C$41)+J12)*IF(K11<='General Assumptions'!$C$32,1,0)","v":0},{"$f":"((K12*'General Assumptions'!$C$41)+K12)*IF(L11<='General Assumptions'!$C$32,1,0)","v":0},{"$f":"((L12*'General Assumptions'!$C$41)+L12)*IF(M11<='General Assumptions'!$C$32,1,0)","v":0},null,null,null,null,null,null,null,"Operating Expenses",{"$f":"-D14","v":15084}]
[null,"  less Vacancy/Bad Debts",null,{"$f":"-D12*'Expense Assumptions'!$D$39","v":-3600},{"$f":"-E12*'Expense Assumptions'!$D$39","v":-3690},{"$f":"-F12*'Expense Assumptions'!$D$39","v":-3782.25},{"$f":"-G12*'Expense Assumptions'!$D$39","v":-3876.8062500000001},{"$f":"-H12*'Expense Assumptions'!$D$39","v":-3973.7264062499999},{"$f":"-I12*'Expense Assumptions'!$D$39","v":-4073.06956640625},{"$f":"-J12*'Expense Assumptions'!$D$39","v":-4174.8963055664062},{"$f":"-K12*'Expense Assumptions'!$D$39","v":0},{"$f":"-L12*'Expense Assumptions'!$D$39","v":0},{"$f":"-M12*'Expense Assumptions'!$D$39","v":0},null,null,null,null,null,null,null,"Debt Service",{"$f":"-D16","v":40794.230007451974}]
[null,"  less Operating Expenses",null,{"$f":"-'Expense Assumptions'!$D$35","v":-15084},{"$f":"((D14*'Expense Assumptions'!$D$38)+D14)*IF(E11<='General Assumptions'!$C$32,1,0)","v":-15385.68},{"$f":"((E14*'Expense Assumptions'!$D$38)+E14)*IF(F11<='General Assumptions'!$C$32,1,0)","v":-15693.393599999999},{"$f":"((F14*'Expense Assumptions'!$D$38)+F14)*IF(G11<='General Assumptions'!$C$32,1,0)","v":-16007.261472},{"$f":"((G14*'Expense Assumptions'!$D$38)+G14)*IF(H11<='General Assumptions'!$C$32,1,0)","v":-16327.406701440001},{"$f":"((H14*'Expense Assumptions'!$D$38)+H14)*IF(I11<='General Assumptions'!$C$32,1,0)","v":-16653.954835468801},{"$f":"((I14*'Expense Assumptions'!$D$38)+I14)*IF(J11<='General Assumptions'!$C$32,1,0)","v":-16987.033932178176},{"$f":"((J14*'Expense Assumptions'!$D$38)+J14)*IF(K11<='General Assumptions'!$C$32,1,0)","v":0},{"$f":"((K14*'Expense Assumptions'!$D$38)+K14)*IF(L11<='General Assumptions'!$C$32,1,0)","v":0},{"$f":"((L14*'Expense Assumptions'!$D$38)+L14)*IF(M11<='General Assumptions'!$C$32,1,0)","v":0},null,null,null,null,null,null,null,"Capital Expenditures",{"$f":"-D17","v":5000}]
[null,"Net Operating Income (NOI)",null,{"$f":"D12+D13+D14","v":53316},{"$f":"E12+E13+E14","v":54724.32},56169.356400000004,57652.057278000007,59173.395017309995,60734.366926249946,62335.995873583539,{"$f":"K12+K13+K14","v":0},0,0]
[null,"   less Debt Service",null,{"$f":"'Mortgage Summary'!C24+'Mortgage Summary'!C25","v":-40794.230007451974},{"$f":"'Mortgage Summary'!D24+'Mortgage Summary'!D25","v":-40794.230007451974},{"$f":"'Mortgage Summary'!E24+'Mortgage Summary'!E25","v":-40794.230007451974},{"$f":"'Mortgage Summary'!F24+'Mortgage Summary'!F25","v":-40794.230007451974},{"$f":"'Mortgage Summary'!G24+'Mortgage Summary'!G25","v":-40794.230007451974},{"$f":"'Mortgage Summary'!H24+'Mortgage Summary'!H25","v":-40794.230007451974},{"$f":"'Mortgage Summary'!I24+'Mortgage Summary'!I25","v":-40794.230007451974},{"$f":"'Mortgage Summary'!J24+'Mortgage Summary'!J25","v":0},{"$f":"'Mortgage Summary'!K24+'Mortgage Summary'!K25","v":0},{"$f":"'Mortgage Summary'!L24+'Mortgage Summary'!L25","v":0}]
[null,"   less Capital Expenditures",null,{"$f":"-'General Assumptions'!C15","v":-5000},0,0,0,0,0,0,0,0,0]
[null,"Annual Cash Flow ",null,{"$f":"D15+D16+D17","v":7521.7699925480265},{"$f":"E15+E16+E17","v":13930.089992548026},15375.126392548031,16857.827270548034,18379.165009858021,19940.136918797973,21541.765866131565,{"$f":"K15+K16+K17","v":0},0,0]
[]
[null,"Property Overview"]
{"$rows_left_out":29}
{"sheet":"Expense Assumptions","index":12,"n_rows":40,"n_cols":4,"rows_kept":40,"cut":false,"hidden":true,"merged":[[4,1,6,7],[8,1,8,3]]}
[]
[]
[]
[]
[null,"Real Estate Investment Analysis Software"]
[]
[]
[]
[null,"Annual Expenses"]
[]
[]
[]
[null,"Expense Description "]
[null,"Accounting",null,1200]
[null,"Advertising",null,0]
[null,"Association Fees",null,0]
[null,"Auto & Travel",null,0]
[null,"Cleaning ",null,0]
[null,"Condo Fee",null,7200]
[null,"Insurance",null,0]
{"$rows_left_out":21}
{"sheet":"Mortgage Summary","index":13,"n_rows":27,"n_cols":12,"rows_kept":27,"cut":false,"hidden":true,"merged":[[4,1,6,11]]}
[]
[]
[]
[]
[null,"Real Estate Investment Analysis Software"]
[]
[]
[]
[null,"MORTGAGE SUMMARY"]
[]
[null,"Total Property Cost ",{"$f":"'General Assumptions'!C12","v":1000000}]
[null,"Down Payment ",{"$f":"'General Assumptions'!C21","v":300000}]
[null,"Mortgage Amount",{"$f":"'General Assumptions'!C22","v":700000}]
[null,"Interest Rate",{"$f":"'General Assumptions'!C23","v":3.2399999999999998E-2}]
[null,"Monthly Interest Rate",{"$f":"'Amortization Schedule'!K17","v":2.6819533824777864E-3}]
[null,"Mortgage Compounding Frequency",{"$f":"'General Assumptions'!C24","v":2}]
[null,"Amortization (Years)",{"$f":"'General Assumptions'!C25","v":25}]
[null,"Total Number of Payments ",{"$f":"C17*12","v":300}]
[null,"Monthly Payment ",{"$f":"-PMT(C15,C18,C13,0,0)","v":3399.519167287664}]
[null,"Total Annual Payment",{"$f":"C19*12","v":40794.230007451966}]
{"$rows_left_out":8}
{"sheet":"Amortization Schedule","index":14,"n_rows":314,"n_cols":11,"rows_kept":314,"cut":false,"hidden":true,"merged":[[4,1,6,10]]}
[]
[]
[]
[]
[null,"Real Estate Investment Analysis Software"]
[]
[]
[]
[]
[null,"AMORTIZATION SCHEDULE"]
[]
[null,"Year","Payment ","Payment ","Monthly","Interest","Amortization","Remaining ",null,"Mortgage ",{"$f":"'Mortgage Summary'!C13","v":700000}]
[null,"#","#","Date","Payment","Paid","Paid","Balance",null,"Annual Compounding Frequency",{"$f":"'General Assumptions'!C24","v":2}]
[null,0,0,{"$f":"'General Assumptions'!C27","v":"2020-07-01"},null,null,null,{"$f":"'General Assumptions'!C22","v":700000},null,"Amortization ",{"$f":"'General Assumptions'!C25","v":25}]
[null,1,1,{"$f":"EDATE(D14,1)","v":"2020-08-01"},{"$f":"$K$18","v":3399.519167287664},{"$f":"IF(H14>0,H14*$K$17,0)","v":1877.3673677344505},{"$f":"IF(H14>0,E15-F15,0)","v":1522.1517995532136},{"$f":"H14-G15","v":698477.84820044681},null,"Total # of Payments",{"$f":"'General Assumptions'!C26","v":300}]
[null,{"$f":"B15","v":1},2,"2020-09-01",3399.519167287664,1873.2850275669941,{"$f":"IF(H15>0,E16-F16,0)","v":1526.2341397206699},{"$f":"H15-G16","v":696951.61406072613},null,"Interest Rate",{"$f":"'General Assumptions'!C23","v":3.2399999999999998E-2}]
[null,{"$f":"B16","v":1},3,"2020-10-01",3399.519167287664,1869.1917387535173,1530.3274285341467,695421.28663219197,null,"Monthly Interest Rate",{"$f":"((1+K16/K13)^(K13/12))-1","v":2.6819533824777864E-3}]
[null,1,4,"2020-11-01",3399.519167287664,1865.0874719302615,1534.4316953574025,693886.85493683454,null,"Monthly Payment",{"$f":"-PMT(K17,K15,K12,0,0)","v":3399.519167287664}]
[null,1,5,"2020-12-01",3399.519167287664,1860.9721976547164,1538.5469696329476,692348.30796720157,null,"Annual Payment  ",{"$f":"K18*12","v":40794.230007451966}]
[null,1,6,"2021-01-01",3399.519167287664,1856.8458864054085,1542.6732808822555,690805.63468631927]
{"$rows_left_out":295}
{"sheet":"Graphs CashFlowProj_CashRet","index":15,"n_rows":1,"n_cols":1,"rows_kept":1,"cut":false,"hidden":true,"merged":[[0,0,1,7]]}
["Cash Flow Projections & Cash On Cash Return"]

{"sheet":"Graphs CapRate_DebtRat","index":16,"n_rows":1,"n_cols":1,"rows_kept":1,"cut":false,"hidden":true,"merged":[[0,0,1,7]]}
["Capitalization Rate & Debt Coverage Ratio"]

{"sheet":"About Us","index":17,"n_rows":23,"n_cols":5,"rows_kept":23,"cut":false,"hidden":true,"merged":[[4,1,7,9],[22,1,49,9],[8,1,8,9]]}
[]
[]
[]
[]
[null,"Real Estate Investment Analysis Software"]
[]
[]
[]
[null,"About Us"]
[]
[]
[]
[]
[]
[null,null,null,null,{"$f":"'Company Info'!B2","v":"[Enter Name]"}]
[null,null,null,null,{"$f":"'Company Info'!B3","v":"[Enter Company Name]"}]
[null,null,null,null,{"$f":"'Company Info'!B4","v":"[Enter Company Address]"}]
[null,null,null,null,{"$f":"'Company Info'!B5","v":"[Enter City, State, Zip]"}]
[null,null,null,null,{"$f":"'Company Info'!B6","v":"[Enter Phone]"}]
[]
{"$rows_left_out":4}
{"sheet":"Terms & Definitions","index":18,"n_rows":53,"n_cols":1,"rows_kept":53,"cut":false,"hidden":true,"merged":[[3,0,5,0]]}
[]
[]
[]
["Real Estate Investment Analysis Software"]
[]
[]
[]
["Terms & Definitions"]
[]
[]
["General Assumptions"]
["Purchase Price – Agreed upon price by the buyer and seller to purchase the property."]
["Closing Costs – Fees paid upon closing of a real estate transaction. For our purposes, this includes all commissions, legal fees, appraisal costs, home inspection, appliances, and taxes."]
["Cash Reserves – Money set aside by the investor(s) for short-term and emergency funds."]
["Initial Improvements – Estimated cost of any property renovations to be made after closing."]
[""]
["Mortgage Details"]
["Down Payment % – Percentage of the full purchase price paid by the buyer at the onset of the property purchase."]
["Total Equity Investment – Amount of cash/down payment the investor makes towards the property purchase."]
["Total Loan Amount – Amount the investor has borrowed to purchase the property."]
{"$rows_left_out":33}